{"text_format":"1","workbook":"xlsx","n_sheets":9,"sheets":["Omslag","Stöd","Betalningsplan","OR-matris","Spec","Verifikat","Analys","Tabell","Admin"],"not_rendered":{"charts":2,"images":16,"macros":1,"external_links":0,"defined_names":78,"comments":1,"pivot_tables":0},"unopened":[],"bounds":{"document_bytes":16777216,"sheet_cells":100000,"rows_first":2000,"rows_last":500,"rows_between":2000,"halvings":0,"cell_chars":16384,"cell_head_chars":4096},"cells_cut":0,"cells_raw":0,"read":"whole","date_system":"1900"}

{"sheet":"Omslag","index":0,"n_rows":27,"n_cols":3,"rows_kept":27,"cut":false,"hidden":false,"merged":[]}
[]
[]
[]
[]
["Objektnamn"]
["---"]
[]
["Skede"]
{"$rows_left_out":20}
{"sheet":"Stöd","index":1,"n_rows":109,"n_cols":2,"rows_kept":109,"cut":false,"hidden":false,"merged":[]}
["Betalningsplan - Stöd"]
[]
["Innehåll"]
[null,"1. Förbered betalningsplan"]
[null,"1.1 Ange uppdragsinformation"]
[null,"1.2 Skapa betalningsplan med betalningsposter"]
[null,"1.2 Fördela betalningsposter per månad"]
[null,"2. Uppmätning"]
{"$rows_left_out":102}
{"sheet":"Betalningsplan","index":2,"n_rows":1001,"n_cols":133,"rows_kept":1001,"cut":false,"hidden":false,"merged":[[4,109,4,112],[4,113,4,116],[4,117,4,120],[4,121,4,124],[4,125,4,128],[4,129,4,132],[4,85,4,88],[4,89,4,92],[4,93,4,96],[4,97,4,100],[4,101,4,104],[4,105,4,108],[4,61,4,64],[4,65,4,68],[4,69,4,72],[4,73,4,76],[4,77,4,80],[4,81,4,84],[4,37,4,40],[4,41,4,44],[4,45,4,48],[4,49,4,52],[4,53,4,56],[4,57,4,60],[4,13,4,16],[4,17,4,20],[4,21,4,24],[4,25,4,28],[4,29,4,32],[4,33,4,36],[3,109,3,112],[3,113,3,116],[3,117,3,120],[3,61,3,64],[3,65,3,68],[3,69,3,72],[3,73,3,76],[3,77,3,80],[3,81,3,84],[3,37,3,40],[3,41,3,44],[3,45,3,48],[3,49,3,52],[3,53,3,56],[3,57,3,60],[3,13,3,16],[3,17,3,20],[3,21,3,24],[3,121,3,124],[3,125,3,128],[3,129,3,132],[3,85,3,88],[3,89,3,92],[3,93,3,96],[3,97,3,100],[3,101,3,104],[3,105,3,108],[3,25,3,28],[3,29,3,32],[3,33,3,36],[2,109,2,112],[2,113,2,116],[2,117,2,120],[2,121,2,124],[2,125,2,128],[2,129,2,132],[2,85,2,88],[2,89,2,92],[2,93,2,96],[2,97,2,100],[2,101,2,104],[2,105,2,108],[2,61,2,64],[2,65,2,68],[2,69,2,72],[2,73,2,76],[2,77,2,80],[2,81,2,84],[2,37,2,40],[2,41,2,44],[2,45,2,48],[2,49,2,52],[2,53,2,56],[2,57,2,60],[1,85,1,96],[1,97,1,108],[1,109,1,120],[1,121,1,132],[2,13,2,16],[2,17,2,20],[2,21,2,24],[2,25,2,28],[2,29,2,32],[2,33,2,36],[0,85,0,96],[0,97,0,108],[0,109,0,120],[0,121,0,132],[1,13,1,24],[1,25,1,36],[1,37,1,48],[1,49,1,60],[1,61,1,72],[1,73,1,84],[0,13,0,24],[0,25,0,36],[0,37,0,48],[0,49,0,60],[0,61,0,72],[0,73,0,84]]}
["Uppdrags-/Projektnamn","Uppdrags-/projektnr.","Avtalsnr. (MD38)","Datum",null,"Handlingsnr.",null,null,null,null,null,null,null,2024,null,null,null,null,null,null,null,null,null,null,null,{"$f":"N1+1","v":2025},null,null,null,null,null,null,null,null,null,null,null,{"$f":"Z1+1","v":2026},null,null,null,null,null,null,null,null,null,null,null,{"$f":"AL1+1","v":2027},null,null,null,null,null,null,null,null,null,null,null,{"$f":"AX1+1","v":2028},null,null,null,null,null,null,null,null,null,null,null,{"$f":"BJ1+1","v":2029},null,null,null,null,null,null,null,null,null,null,null,{"$f":"BV1+1","v":2030},null,null,null,null,null,null,null,null,null,null,null,{"$f":"CH1+1","v":2031},null,null,null,null,null,null,null,null,null,null,null,{"$f":"CT1+1","v":2032},null,null,null,null,null,null,null,null,null,null,null,{"$f":"DF1+1","v":2033}]
[null,null,null,null,null,null,null,null,null,null,null,null,null,{"$f":"SUM(N7:Y7)","v":0},null,null,null,null,null,null,null,null,null,null,null,{"$f":"SUM(Z7:AK7)","v":0},null,null,null,null,null,null,null,null,null,null,null,{"$f":"SUM(AL7:AW7)","v":0},null,null,null,null,null,null,null,null,null,null,null,{"$f":"SUM(AX7:BI7)","v":0},null,null,null,null,null,null,null,null,null,null,null,{"$f":"SUM(BJ7:BU7)","v":0},null,null,null,null,null,null,null,null,null,null,null,{"$f":"SUM(BV7:CG7)","v":0},null,null,null,null,null,null,null,null,null,null,null,{"$f":"SUM(CH7:CS7)","v":0},null,null,null,null,null,null,null,null,null,null,null,{"$f":"SUM(CT7:DE7)","v":0},null,null,null,null,null,null,null,null,null,null,null,{"$f":"SUM(DF7:DQ7)","v":0},null,null,null,null,null,null,null,null,null,null,null,{"$f":"SUM(DR7:EC7)","v":0}]
["Status","Handläggare",null,"Rev datum",null,"Kontraktsumma",null,null,null,null,null,null,null,"T1",null,null,null,"T2",null,null,null,"T3",null,null,null,"T1",null,null,null,"T2",null,null,null,"T3",null,null,null,"T1",null,null,null,"T2",null,null,null,"T3",null,null,null,"T1",null,null,null,"T2",null,null,null,"T3",null,null,null,"T1",null,null,null,"T2",null,null,null,"T3",null,null,null,"T1",null,null,null,"T2",null,null,null,"T3",null,null,null,"T1",null,null,null,"T2",null,null,null,"T3",null,null,null,"T1",null,null,null,"T2",null,null,null,"T3",null,null,null,"T1",null,null,null,"T2",null,null,null,"T3",null,null,null,"T1",null,null,null,"T2",null,null,null,"T3"]
[null,null,null,null,null,null,{"$f":"SUM(TabellBetalplan[Belopp*])","v":0},null,null,null,null,null,null,{"$f":"SUM(N6:Q6)","v":0},null,null,null,{"$f":"SUM(R6:U6)","v":0},null,null,null,{"$f":"SUM(V6:Y6)","v":0},null,null,null,{"$f":"SUM(Z6:AC6)","v":0},null,null,null,{"$f":"SUM(AD6:AG6)","v":0},null,null,null,{"$f":"SUM(AH6:AK6)","v":0},null,null,null,{"$f":"SUM(AL6:AO6)","v":0},null,null,null,{"$f":"SUM(AP6:AS6)","v":0},null,null,null,{"$f":"SUM(AT6:AW6)","v":0},null,null,null,{"$f":"SUM(AX6:BA6)","v":0},null,null,null,{"$f":"SUM(BB6:BE6)","v":0},null,null,null,{"$f":"SUM(BF6:BI6)","v":0},null,null,null,{"$f":"SUM(BJ6:BM6)","v":0},null,null,null,{"$f":"SUM(BN6:BQ6)","v":0},null,null,null,{"$f":"SUM(BR6:BU6)","v":0},null,null,null,{"$f":"SUM(BV6:BY6)","v":0},null,null,null,{"$f":"SUM(BZ6:CC6)","v":0},null,null,null,{"$f":"SUM(CD6:CG6)","v":0},null,null,null,{"$f":"SUM(CH6:CK6)","v":0},null,null,null,{"$f":"SUM(CL6:CO6)","v":0},null,null,null,{"$f":"SUM(CP6:CS6)","v":0},null,null,null,{"$f":"SUM(CT6:CW6)","v":0},null,null,null,{"$f":"SUM(CX6:DA6)","v":0},null,null,null,{"$f":"SUM(DB6:DE6)","v":0},null,null,null,{"$f":"SUM(DF6:DI6)","v":0},null,null,null,{"$f":"SUM(DJ6:DM6)","v":0},null,null,null,{"$f":"SUM(DN6:DQ6)","v":0},null,null,null,{"$f":"SUM(DR6:DU6)","v":0},null,null,null,{"$f":"SUM(DV6:DY6)","v":0},null,null,null,{"$f":"SUM(DZ6:EC6)","v":0}]
[null,null,null,null,null,null,null,null,null,null,null,null,null,{"$f":"SUM(N7:Q7)","v":0},null,null,null,0,null,null,null,0,null,null,null,{"$f":"SUM(Z7:AC7)","v":0},null,null,null,0,null,null,null,0,null,null,null,{"$f":"SUM(AL7:AO7)","v":0},null,null,null,0,null,null,null,0,null,null,null,{"$f":"SUM(AX7:BA7)","v":0},null,null,null,0,null,null,null,0,null,null,null,{"$f":"SUM(BJ7:BM7)","v":0},null,null,null,0,null,null,null,0,null,null,null,{"$f":"SUM(BV7:BY7)","v":0},null,null,null,0,null,null,null,0,null,null,null,{"$f":"SUM(CH7:CK7)","v":0},null,null,null,0,null,null,null,0,null,null,null,{"$f":"SUM(CT7:CW7)","v":0},null,null,null,0,null,null,null,0,null,null,null,{"$f":"SUM(DF7:DI7)","v":0},null,null,null,0,null,null,null,0,null,null,null,{"$f":"SUM(DR7:DU7)","v":0},null,null,null,0,null,null,null,0]
[null,null,null,null,null,null,{"$f":"SUBTOTAL(109,TabellBetalplan[Belopp*])","v":0},null,{"$f":"SUBTOTAL(109,TabellBetalplan[Upparb.\nbelopp])","v":0},{"$f":"IFERROR(I6/G6,0)","v":0},{"$f":"SUBTOTAL(109,TabellBetalplan[Prognos])","v":0},{"$f":"SUBTOTAL(109,TabellBetalplan[Störnings-belopp])","v":0},{"$f":"SUBTOTAL(109,TabellBetalplan[Att fördela])","v":0},{"$f":"SUBTOTAL(109,TabellBetalplan[jan-24])","v":0},{"$f":"SUBTOTAL(109,TabellBetalplan[feb-24])","v":0},{"$f":"SUBTOTAL(109,TabellBetalplan[mar-24])","v":0},{"$f":"SUBTOTAL(109,TabellBetalplan[apr-24])","v":0},{"$f":"SUBTOTAL(109,TabellBetalplan[maj-24])","v":0},{"$f":"SUBTOTAL(109,TabellBetalplan[jun-24])","v":0},{"$f":"SUBTOTAL(109,TabellBetalplan[jul-24])","v":0},{"$f":"SUBTOTAL(109,TabellBetalplan[aug-24])","v":0},{"$f":"SUBTOTAL(109,TabellBetalplan[sep-24])","v":0},{"$f":"SUBTOTAL(109,TabellBetalplan[okt-24])","v":0},{"$f":"SUBTOTAL(109,TabellBetalplan[nov-24])","v":0},{"$f":"SUBTOTAL(109,TabellBetalplan[dec-24])","v":0},{"$f":"SUBTOTAL(109,TabellBetalplan[jan-25])","v":0},{"$f":"SUBTOTAL(109,TabellBetalplan[feb-25])","v":0},{"$f":"SUBTOTAL(109,TabellBetalplan[mar-25])","v":0},{"$f":"SUBTOTAL(109,TabellBetalplan[apr-25])","v":0},{"$f":"SUBTOTAL(109,TabellBetalplan[maj-25])","v":0},{"$f":"SUBTOTAL(109,TabellBetalplan[jun-25])","v":0},{"$f":"SUBTOTAL(109,TabellBetalplan[jul-25])","v":0},{"$f":"SUBTOTAL(109,TabellBetalplan[aug-25])","v":0},{"$f":"SUBTOTAL(109,TabellBetalplan[sep-25])","v":0},{"$f":"SUBTOTAL(109,TabellBetalplan[okt-25])","v":0},{"$f":"SUBTOTAL(109,TabellBetalplan[nov-25])","v":0},{"$f":"SUBTOTAL(109,TabellBetalplan[dec-25])","v":0},{"$f":"SUBTOTAL(109,TabellBetalplan[jan-26])","v":0},{"$f":"SUBTOTAL(109,TabellBetalplan[feb-26])","v":0},{"$f":"SUBTOTAL(109,TabellBetalplan[mar-26])","v":0},{"$f":"SUBTOTAL(109,TabellBetalplan[apr-26])","v":0},{"$f":"SUBTOTAL(109,TabellBetalplan[maj-26])","v":0},{"$f":"SUBTOTAL(109,TabellBetalplan[jun-26])","v":0},{"$f":"SUBTOTAL(109,TabellBetalplan[jul-26])","v":0},{"$f":"SUBTOTAL(109,TabellBetalplan[aug-26])","v":0},{"$f":"SUBTOTAL(109,TabellBetalplan[sep-26])","v":0},{"$f":"SUBTOTAL(109,TabellBetalplan[okt-26])","v":0},{"$f":"SUBTOTAL(109,TabellBetalplan[nov-26])","v":0},{"$f":"SUBTOTAL(109,TabellBetalplan[dec-26])","v":0},{"$f":"SUBTOTAL(109,TabellBetalplan[jan-27])","v":0},{"$f":"SUBTOTAL(109,TabellBetalplan[feb-27])","v":0},{"$f":"SUBTOTAL(109,TabellBetalplan[mar-27])","v":0},{"$f":"SUBTOTAL(109,TabellBetalplan[apr-27])","v":0},{"$f":"SUBTOTAL(109,TabellBetalplan[maj-27])","v":0},{"$f":"SUBTOTAL(109,TabellBetalplan[jun-27])","v":0},{"$f":"SUBTOTAL(109,TabellBetalplan[jul-27])","v":0},{"$f":"SUBTOTAL(109,TabellBetalplan[aug-27])","v":0},{"$f":"SUBTOTAL(109,TabellBetalplan[sep-27])","v":0},{"$f":"SUBTOTAL(109,TabellBetalplan[okt-27])","v":0},{"$f":"SUBTOTAL(109,TabellBetalplan[nov-27])","v":0},{"$f":"SUBTOTAL(109,TabellBetalplan[dec-27])","v":0},{"$f":"SUBTOTAL(109,TabellBetalplan[jan-28])","v":0},{"$f":"SUBTOTAL(109,TabellBetalplan[feb-28])","v":0},{"$f":"SUBTOTAL(109,TabellBetalplan[mar-28])","v":0},{"$f":"SUBTOTAL(109,TabellBetalplan[apr-28])","v":0},{"$f":"SUBTOTAL(109,TabellBetalplan[maj-28])","v":0},{"$f":"SUBTOTAL(109,TabellBetalplan[jun-28])","v":0},{"$f":"SUBTOTAL(109,TabellBetalplan[jul-28])","v":0},{"$f":"SUBTOTAL(109,TabellBetalplan[aug-28])","v":0},{"$f":"SUBTOTAL(109,TabellBetalplan[sep-28])","v":0},{"$f":"SUBTOTAL(109,TabellBetalplan[okt-28])","v":0},{"$f":"SUBTOTAL(109,TabellBetalplan[nov-28])","v":0},{"$f":"SUBTOTAL(109,TabellBetalplan[dec-28])","v":0},{"$f":"SUBTOTAL(109,TabellBetalplan[jan-29])","v":0},{"$f":"SUBTOTAL(109,TabellBetalplan[feb-29])","v":0},{"$f":"SUBTOTAL(109,TabellBetalplan[mar-29])","v":0},{"$f":"SUBTOTAL(109,TabellBetalplan[apr-29])","v":0},{"$f":"SUBTOTAL(109,TabellBetalplan[maj-29])","v":0},{"$f":"SUBTOTAL(109,TabellBetalplan[jun-29])","v":0},{"$f":"SUBTOTAL(109,TabellBetalplan[jul-29])","v":0},{"$f":"SUBTOTAL(109,TabellBetalplan[aug-29])","v":0},{"$f":"SUBTOTAL(109,TabellBetalplan[sep-29])","v":0},{"$f":"SUBTOTAL(109,TabellBetalplan[okt-29])","v":0},{"$f":"SUBTOTAL(109,TabellBetalplan[nov-29])","v":0},{"$f":"SUBTOTAL(109,TabellBetalplan[dec-29])","v":0},{"$f":"SUBTOTAL(109,TabellBetalplan[jan-30])","v":0},{"$f":"SUBTOTAL(109,TabellBetalplan[feb-30])","v":0},{"$f":"SUBTOTAL(109,TabellBetalplan[mar-30])","v":0},{"$f":"SUBTOTAL(109,TabellBetalplan[apr-30])","v":0},{"$f":"SUBTOTAL(109,TabellBetalplan[maj-30])","v":0},{"$f":"SUBTOTAL(109,TabellBetalplan[jun-30])","v":0},{"$f":"SUBTOTAL(109,TabellBetalplan[jul-30])","v":0},{"$f":"SUBTOTAL(109,TabellBetalplan[aug-30])","v":0},{"$f":"SUBTOTAL(109,TabellBetalplan[sep-30])","v":0},{"$f":"SUBTOTAL(109,TabellBetalplan[okt-30])","v":0},{"$f":"SUBTOTAL(109,TabellBetalplan[nov-30])","v":0},{"$f":"SUBTOTAL(109,TabellBetalplan[dec-30])","v":0},{"$f":"SUBTOTAL(109,TabellBetalplan[jan-31])","v":0},{"$f":"SUBTOTAL(109,TabellBetalplan[feb-31])","v":0},{"$f":"SUBTOTAL(109,TabellBetalplan[mar-31])","v":0},{"$f":"SUBTOTAL(109,TabellBetalplan[apr-31])","v":0},{"$f":"SUBTOTAL(109,TabellBetalplan[maj-31])","v":0},{"$f":"SUBTOTAL(109,TabellBetalplan[jun-31])","v":0},{"$f":"SUBTOTAL(109,TabellBetalplan[jul-31])","v":0},{"$f":"SUBTOTAL(109,TabellBetalplan[aug-31])","v":0},{"$f":"SUBTOTAL(109,TabellBetalplan[sep-31])","v":0},{"$f":"SUBTOTAL(109,TabellBetalplan[okt-31])","v":0},{"$f":"SUBTOTAL(109,TabellBetalplan[nov-31])","v":0},{"$f":"SUBTOTAL(109,TabellBetalplan[dec-31])","v":0},{"$f":"SUBTOTAL(109,TabellBetalplan[jan-32])","v":0},{"$f":"SUBTOTAL(109,TabellBetalplan[feb-32])","v":0},{"$f":"SUBTOTAL(109,TabellBetalplan[mar-32])","v":0},{"$f":"SUBTOTAL(109,TabellBetalplan[apr-32])","v":0},{"$f":"SUBTOTAL(109,TabellBetalplan[maj-32])","v":0},{"$f":"SUBTOTAL(109,TabellBetalplan[jun-32])","v":0},{"$f":"SUBTOTAL(109,TabellBetalplan[jul-32])","v":0},{"$f":"SUBTOTAL(109,TabellBetalplan[aug-32])","v":0},{"$f":"SUBTOTAL(109,TabellBetalplan[sep-32])","v":0},{"$f":"SUBTOTAL(109,TabellBetalplan[okt-32])","v":0},{"$f":"SUBTOTAL(109,TabellBetalplan[nov-32])","v":0},{"$f":"SUBTOTAL(109,TabellBetalplan[dec-32])","v":0},{"$f":"SUBTOTAL(109,TabellBetalplan[jan-33])","v":0},{"$f":"SUBTOTAL(109,TabellBetalplan[feb-33])","v":0},{"$f":"SUBTOTAL(109,TabellBetalplan[mar-33])","v":0},{"$f":"SUBTOTAL(109,TabellBetalplan[apr-33])","v":0},{"$f":"SUBTOTAL(109,TabellBetalplan[maj-33])","v":0},{"$f":"SUBTOTAL(109,TabellBetalplan[jun-33])","v":0},{"$f":"SUBTOTAL(109,TabellBetalplan[jul-33])","v":0},{"$f":"SUBTOTAL(109,TabellBetalplan[aug-33])","v":0},{"$f":"SUBTOTAL(109,TabellBetalplan[sep-33])","v":0},{"$f":"SUBTOTAL(109,TabellBetalplan[okt-33])","v":0},{"$f":"SUBTOTAL(109,TabellBetalplan[nov-33])","v":0},{"$f":"SUBTOTAL(109,TabellBetalplan[dec-33])","v":0}]
[null,null,null,null,null,null,{"$f":"SUM(TabellBetalplan[Belopp*])","v":0},null,{"$f":"SUM(TabellBetalplan[Upparb.\nbelopp])","v":0},{"$f":"IFERROR(I7/G7,0)","v":0},{"$f":"SUM(TabellBetalplan[Prognos])","v":0},{"$f":"SUM(TabellBetalplan[Störnings-belopp])","v":0},{"$f":"SUM(TabellBetalplan[Att fördela])","v":0},{"$f":"SUM(TabellBetalplan[jan-24])","v":0},{"$f":"SUM(TabellBetalplan[feb-24])","v":0},{"$f":"SUM(TabellBetalplan[mar-24])","v":0},{"$f":"SUM(TabellBetalplan[apr-24])","v":0},{"$f":"SUM(TabellBetalplan[maj-24])","v":0},{"$f":"SUM(TabellBetalplan[jun-24])","v":0},{"$f":"SUM(TabellBetalplan[jul-24])","v":0},{"$f":"SUM(TabellBetalplan[aug-24])","v":0},{"$f":"SUM(TabellBetalplan[sep-24])","v":0},{"$f":"SUM(TabellBetalplan[okt-24])","v":0},{"$f":"SUM(TabellBetalplan[nov-24])","v":0},{"$f":"SUM(TabellBetalplan[dec-24])","v":0},{"$f":"SUM(TabellBetalplan[jan-25])","v":0},{"$f":"SUM(TabellBetalplan[feb-25])","v":0},{"$f":"SUM(TabellBetalplan[mar-25])","v":0},{"$f":"SUM(TabellBetalplan[apr-25])","v":0},{"$f":"SUM(TabellBetalplan[maj-25])","v":0},{"$f":"SUM(TabellBetalplan[jun-25])","v":0},{"$f":"SUM(TabellBetalplan[jul-25])","v":0},{"$f":"SUM(TabellBetalplan[aug-25])","v":0},{"$f":"SUM(TabellBetalplan[sep-25])","v":0},{"$f":"SUM(TabellBetalplan[okt-25])","v":0},{"$f":"SUM(TabellBetalplan[nov-25])","v":0},{"$f":"SUM(TabellBetalplan[dec-25])","v":0},{"$f":"SUM(TabellBetalplan[jan-26])","v":0},{"$f":"SUM(TabellBetalplan[feb-26])","v":0},{"$f":"SUM(TabellBetalplan[mar-26])","v":0},{"$f":"SUM(TabellBetalplan[apr-26])","v":0},{"$f":"SUM(TabellBetalplan[maj-26])","v":0},{"$f":"SUM(TabellBetalplan[jun-26])","v":0},{"$f":"SUM(TabellBetalplan[jul-26])","v":0},{"$f":"SUM(TabellBetalplan[aug-26])","v":0},{"$f":"SUM(TabellBetalplan[sep-26])","v":0},{"$f":"SUM(TabellBetalplan[okt-26])","v":0},{"$f":"SUM(TabellBetalplan[nov-26])","v":0},{"$f":"SUM(TabellBetalplan[dec-26])","v":0},{"$f":"SUM(TabellBetalplan[jan-27])","v":0},{"$f":"SUM(TabellBetalplan[feb-27])","v":0},{"$f":"SUM(TabellBetalplan[mar-27])","v":0},{"$f":"SUM(TabellBetalplan[apr-27])","v":0},{"$f":"SUM(TabellBetalplan[maj-27])","v":0},{"$f":"SUM(TabellBetalplan[jun-27])","v":0},{"$f":"SUM(TabellBetalplan[jul-27])","v":0},{"$f":"SUM(TabellBetalplan[aug-27])","v":0},{"$f":"SUM(TabellBetalplan[sep-27])","v":0},{"$f":"SUM(TabellBetalplan[okt-27])","v":0},{"$f":"SUM(TabellBetalplan[nov-27])","v":0},{"$f":"SUM(TabellBetalplan[dec-27])","v":0},{"$f":"SUM(TabellBetalplan[jan-28])","v":0},{"$f":"SUM(TabellBetalplan[feb-28])","v":0},{"$f":"SUM(TabellBetalplan[mar-28])","v":0},{"$f":"SUM(TabellBetalplan[apr-28])","v":0},{"$f":"SUM(TabellBetalplan[maj-28])","v":0},{"$f":"SUM(TabellBetalplan[jun-28])","v":0},{"$f":"SUM(TabellBetalplan[jul-28])","v":0},{"$f":"SUM(TabellBetalplan[aug-28])","v":0},{"$f":"SUM(TabellBetalplan[sep-28])","v":0},{"$f":"SUM(TabellBetalplan[okt-28])","v":0},{"$f":"SUM(TabellBetalplan[nov-28])","v":0},{"$f":"SUM(TabellBetalplan[dec-28])","v":0},{"$f":"SUM(TabellBetalplan[jan-29])","v":0},{"$f":"SUM(TabellBetalplan[feb-29])","v":0},{"$f":"SUM(TabellBetalplan[mar-29])","v":0},{"$f":"SUM(TabellBetalplan[apr-29])","v":0},{"$f":"SUM(TabellBetalplan[maj-29])","v":0},{"$f":"SUM(TabellBetalplan[jun-29])","v":0},{"$f":"SUM(TabellBetalplan[jul-29])","v":0},{"$f":"SUM(TabellBetalplan[aug-29])","v":0},{"$f":"SUM(TabellBetalplan[sep-29])","v":0},{"$f":"SUM(TabellBetalplan[okt-29])","v":0},{"$f":"SUM(TabellBetalplan[nov-29])","v":0},{"$f":"SUM(TabellBetalplan[dec-29])","v":0},{"$f":"SUM(TabellBetalplan[jan-30])","v":0},{"$f":"SUM(TabellBetalplan[feb-30])","v":0},{"$f":"SUM(TabellBetalplan[mar-30])","v":0},{"$f":"SUM(TabellBetalplan[apr-30])","v":0},{"$f":"SUM(TabellBetalplan[maj-30])","v":0},{"$f":"SUM(TabellBetalplan[jun-30])","v":0},{"$f":"SUM(TabellBetalplan[jul-30])","v":0},{"$f":"SUM(TabellBetalplan[aug-30])","v":0},{"$f":"SUM(TabellBetalplan[sep-30])","v":0},{"$f":"SUM(TabellBetalplan[okt-30])","v":0},{"$f":"SUM(TabellBetalplan[nov-30])","v":0},{"$f":"SUM(TabellBetalplan[dec-30])","v":0},{"$f":"SUM(TabellBetalplan[jan-31])","v":0},{"$f":"SUM(TabellBetalplan[feb-31])","v":0},{"$f":"SUM(TabellBetalplan[mar-31])","v":0},{"$f":"SUM(TabellBetalplan[apr-31])","v":0},{"$f":"SUM(TabellBetalplan[maj-31])","v":0},{"$f":"SUM(TabellBetalplan[jun-31])","v":0},{"$f":"SUM(TabellBetalplan[jul-31])","v":0},{"$f":"SUM(TabellBetalplan[aug-31])","v":0},{"$f":"SUM(TabellBetalplan[sep-31])","v":0},{"$f":"SUM(TabellBetalplan[okt-31])","v":0},{"$f":"SUM(TabellBetalplan[nov-31])","v":0},{"$f":"SUM(TabellBetalplan[dec-31])","v":0},{"$f":"SUM(TabellBetalplan[jan-32])","v":0},{"$f":"SUM(TabellBetalplan[feb-32])","v":0},{"$f":"SUM(TabellBetalplan[mar-32])","v":0},{"$f":"SUM(TabellBetalplan[apr-32])","v":0},{"$f":"SUM(TabellBetalplan[maj-32])","v":0},{"$f":"SUM(TabellBetalplan[jun-32])","v":0},{"$f":"SUM(TabellBetalplan[jul-32])","v":0},{"$f":"SUM(TabellBetalplan[aug-32])","v":0},{"$f":"SUM(TabellBetalplan[sep-32])","v":0},{"$f":"SUM(TabellBetalplan[okt-32])","v":0},{"$f":"SUM(TabellBetalplan[nov-32])","v":0},{"$f":"SUM(TabellBetalplan[dec-32])","v":0},{"$f":"SUM(TabellBetalplan[jan-33])","v":0},{"$f":"SUM(TabellBetalplan[feb-33])","v":0},{"$f":"SUM(TabellBetalplan[mar-33])","v":0},{"$f":"SUM(TabellBetalplan[apr-33])","v":0},{"$f":"SUM(TabellBetalplan[maj-33])","v":0},{"$f":"SUM(TabellBetalplan[jun-33])","v":0},{"$f":"SUM(TabellBetalplan[jul-33])","v":0},{"$f":"SUM(TabellBetalplan[aug-33])","v":0},{"$f":"SUM(TabellBetalplan[sep-33])","v":0},{"$f":"SUM(TabellBetalplan[okt-33])","v":0},{"$f":"SUM(TabellBetalplan[nov-33])","v":0},{"$f":"SUM(TabellBetalplan[dec-33])","v":0}]
["Betalningspost*","Aktivitet*","Arbetsorder*","Skede","Teknikslag","Fritext","Belopp*","Plats","Upparb.\nbelopp","Upparb.\nprocent","Prognos","Störnings-belopp","Att fördela","jan-24","feb-24","mar-24","apr-24","maj-24","jun-24","jul-24","aug-24","sep-24","okt-24","nov-24","dec-24","jan-25","feb-25","mar-25","apr-25","maj-25","jun-25","jul-25","aug-25","sep-25","okt-25","nov-25","dec-25","jan-26","feb-26","mar-26","apr-26","maj-26","jun-26","jul-26","aug-26","sep-26","okt-26","nov-26","dec-26","jan-27","feb-27","mar-27","apr-27","maj-27","jun-27","jul-27","aug-27","sep-27","okt-27","nov-27","dec-27","jan-28","feb-28","mar-28","apr-28","maj-28","jun-28","jul-28","aug-28","sep-28","okt-28","nov-28","dec-28","jan-29","feb-29","mar-29","apr-29","maj-29","jun-29","jul-29","aug-29","sep-29","okt-29","nov-29","dec-29","jan-30","feb-30","mar-30","apr-30","maj-30","jun-30","jul-30","aug-30","sep-30","okt-30","nov-30","dec-30","jan-31","feb-31","mar-31","apr-31","maj-31","jun-31","jul-31","aug-31","sep-31","okt-31","nov-31","dec-31","jan-32","feb-32","mar-32","apr-32","maj-32","jun-32","jul-32","aug-32","sep-32","okt-32","nov-32","dec-32","jan-33","feb-33","mar-33","apr-33","maj-33","jun-33","jul-33","aug-33","sep-33","okt-33","nov-33","dec-33"]
{"$rows_left_out":994}
{"sheet":"OR-matris","index":3,"n_rows":27,"n_cols":15,"rows_kept":27,"cut":false,"hidden":true,"merged":[[0,13,0,14],[3,2,3,5]]}
["Mall Betalningsplan - Basunderhåll Väg",null,null,null,null,null,null,"Område: ",null,null,null,null,null,"2023-09-01"]
[]
["Index:",1]
[]
["MF","Arbete","Sep","Okt","Nov","Dec","Jan","Feb","Mar","Apr","Maj","Jun","Jul","Aug","Totalt"]
["konto"]
[81,"Vinterväghållning",0.08,0.08,0.1,0.11,0.11,0.11,0.1,0.08,7.0000000000000007E-2,0.05,0.05,0.06,{"$f":"SUM(C7:N7)","v":1}]
[null,{"$f":"SUMIFS(Betalningsplan!$G:$G,Betalningsplan!$A:$A,A7&\"*\",Betalningsplan!$C:$C,\"OR\")","v":0},{"$f":"$B8*C7*$B$3","v":0},{"$f":"$B8*D7*$B$3","v":0},0,0,0,0,0,0,0,0,0,0,{"$f":"SUM(C8:N8)","v":0}]
{"$rows_left_out":20}
{"sheet":"Spec","index":4,"n_rows":135,"n_cols":7,"rows_kept":135,"cut":false,"hidden":false,"merged":[]}
["Betalningsplan - Specifikation"]
[]
[]
[]
["Kontrakt"]
[null,"Betalningspost*","","Plats",null,"Rad:",9]
[null,"Aktivitet*",null,"Upparb. belopp"]
[null,"Arbetsorder*",null,"Upparb. procent",0]
{"$rows_left_out":128}
{"sheet":"Verifikat","index":5,"n_rows":49,"n_cols":10,"rows_kept":49,"cut":false,"hidden":false,"merged":[[47,0,47,7],[47,8,47,9],[11,4,11,5],[11,6,11,7],[11,8,11,9],[12,4,12,5],[12,6,12,7],[12,8,12,9],[39,1,39,2],[46,0,46,6],[10,8,10,9],[3,1,5,1],[3,4,3,5],[3,6,3,7],[5,2,5,3],[5,4,5,5],[5,6,5,7],[7,2,7,3],[7,4,7,5],[7,6,7,7],[10,4,10,5],[10,6,10,7]]}
[null,null,null,null,null,null,null,null,null,"Mätsedelsverifikat"]
[null,null,null,null,null,null,null,null,null,"Uppmätningsperiod"]
[null,"Uppdragsnamn","Uppdragsnummer","Avtalsnr. (MD38)","Kontraktsdatum",null,"EF-nummer",null,null,"jan-24"]
[]
[null,null,"Referensperson beställare",null,"Störningsbelopp",null,"Kontraktssumma"]
[null,null,null,null,{"$f":"Betalningsplan!$L$7","v":0},null,{"$f":"InfoContractSum","v":0}]
[null,"Leverantör","Referensperson leverantör",null,null,null,"Prognos"]
[null,null,null,null,null,null,{"$f":"Betalningsplan!$K$7","v":0}]
{"$rows_left_out":42}
{"sheet":"Analys","index":6,"n_rows":40,"n_cols":1,"rows_kept":40,"cut":false,"hidden":false,"merged":[[39,0,40,20],[0,18,0,19]]}
["Betalningsplan - Analys"]
[]
[]
[]
[]
[]
[]
[]
{"$rows_left_out":33}
{"sheet":"Tabell","index":7,"n_rows":124,"n_cols":13,"rows_kept":124,"cut":false,"hidden":true,"merged":[]}
[]
["TOTAL",null,null,null,null,"FILTRERAD",null,null,null,null,"TIDSFÖRSKJUTNING",null,{"$f":"30.437*(M3-L2)","v":0}]
[null,null,null,null,null,null,null,null,null,null,null,{"$f":"IFERROR(SUMPRODUCT(K5:K64,L5:L64)/SUM(L5:L64),0)","v":2},{"$f":"IFERROR(SUMPRODUCT(K5:K64,M5:M64)/SUM(M5:M64),0)","v":0}]
["Datum","Utfall","Prognos","Ackumulerat","Ursprunglig","Datum","Utfall","Prognos","Ackumulerat",null,"Månad","Ursprunglig","Aktuell"]
[{"$f":"Betalningsplan!$N$8","v":"jan-24"},null,{"$f":"Betalningsplan!$N$7","v":0},{"$f":"SUM(($B$5:C5))","v":0},null,{"$f":"Betalningsplan!$N$8","v":"jan-24"},null,{"$f":"Betalningsplan!$N$6","v":0},{"$f":"SUM(($G$5:H5))","v":0},null,1,123,{"$f":"SUM(B5:C5)","v":0}]
[{"$f":"Betalningsplan!$O$8","v":"feb-24"},null,{"$f":"Betalningsplan!$O$7","v":0},{"$f":"SUM(($B$5:C6))","v":0},null,{"$f":"Betalningsplan!$O$8","v":"feb-24"},null,{"$f":"Betalningsplan!$O$6","v":0},{"$f":"SUM(($G$5:H6))","v":0},null,2,123,{"$f":"SUM(B6:C6)","v":0}]
[{"$f":"Betalningsplan!$P$8","v":"mar-24"},null,{"$f":"Betalningsplan!$P$7","v":0},{"$f":"SUM(($B$5:C7))","v":0},null,{"$f":"Betalningsplan!$P$8","v":"mar-24"},null,{"$f":"Betalningsplan!$P$6","v":0},{"$f":"SUM(($G$5:H7))","v":0},null,3,123,0]
[{"$f":"Betalningsplan!$Q$8","v":"apr-24"},null,{"$f":"Betalningsplan!$Q$7","v":0},{"$f":"SUM(($B$5:C8))","v":0},null,{"$f":"Betalningsplan!$Q$8","v":"apr-24"},null,{"$f":"Betalningsplan!$Q$6","v":0},{"$f":"SUM(($G$5:H8))","v":0},null,4,0,0]
{"$rows_left_out":117}
{"sheet":"Admin","index":8,"n_rows":18,"n_cols":2,"rows_kept":18,"cut":false,"hidden":true,"merged":[]}
[]
["AdminPassword"]
["AdminPasswordSetDate"]
["AdminPasswordSetBy"]
["AdminVersion","9.0"]
["AdminWebsite","https://arbetsrum.sp.trafikverket.se/sites/20190503140230/home/MSS/Sidor/Start.aspx"]
["InfoProjectName"]
["InfoProjectNo"]
{"$rows_left_out":10}